CRAN Package Check Results for Package vctrs

Last updated on 2020-05-24 23:47:58 CEST.

Flavor Version Tinstall Tcheck Ttotal Status Flags
r-devel-linux-x86_64-debian-clang 0.3.0 25.38 122.09 147.47 ERROR
r-devel-linux-x86_64-debian-gcc 0.3.0 17.66 89.45 107.11 ERROR
r-devel-linux-x86_64-fedora-clang 0.3.0 185.32 ERROR
r-devel-linux-x86_64-fedora-gcc 0.3.0 159.37 ERROR
r-devel-windows-ix86+x86_64 0.3.0 6.00 8.00 14.00 ERROR
r-patched-linux-x86_64 0.3.0 19.09 121.52 140.61 OK
r-patched-solaris-x86 0.3.0 223.10 OK
r-release-linux-x86_64 0.3.0 18.76 122.43 141.19 OK
r-release-osx-x86_64 0.3.0 OK
r-release-windows-ix86+x86_64 0.3.0 3.00 8.00 11.00 ERROR
r-oldrel-osx-x86_64 0.3.0 OK
r-oldrel-windows-ix86+x86_64 0.3.0 78.00 234.00 312.00 OK

Additional issues

LTO

Check Details

Version: 0.3.0
Check: tests
Result: ERROR
     Running 'testthat.R' [54s/59s]
    Running the tests in 'tests/testthat.R' failed.
    Complete output:
     > library(testthat)
     > library(vctrs)
     >
     > if (requireNamespace("xml2")) {
     + test_check("vctrs", reporter = MultiReporter$new(reporters = list(JunitReporter$new(file = "test-results.xml"), CheckReporter$new())))
     + } else {
     + test_check("vctrs")
     + }
     Loading required namespace: xml2
     -- 1. Failure: `vec_c()` throws the right error with subclassed factors (#1015)
     vec_c(a, a) not identical to subclass(factor(c("a", "a"))).
     Attributes: < Component "class": Lengths (1, 3) differ (string compare on first 1) >
     Attributes: < Component "class": 1 string mismatch >
    
     -- 2. Failure: `vec_c()` throws the right error with subclassed factors (#1015)
     `vec_c(a, b)` did not throw an error.
    
     == testthat results ===========================================================
     [ OK: 3615 | SKIPPED: 27 | WARNINGS: 0 | FAILED: 2 ]
     1. Failure: `vec_c()` throws the right error with subclassed factors (#1015) (@test-type-factor.R#30)
     2. Failure: `vec_c()` throws the right error with subclassed factors (#1015) (@test-type-factor.R#31)
    
     Error: testthat unit tests failed
     Execution halted
Flavor: r-devel-linux-x86_64-debian-clang

Version: 0.3.0
Check: tests
Result: ERROR
     Running ‘testthat.R’ [37s/52s]
    Running the tests in ‘tests/testthat.R’ failed.
    Complete output:
     > library(testthat)
     > library(vctrs)
     >
     > if (requireNamespace("xml2")) {
     + test_check("vctrs", reporter = MultiReporter$new(reporters = list(JunitReporter$new(file = "test-results.xml"), CheckReporter$new())))
     + } else {
     + test_check("vctrs")
     + }
     Loading required namespace: xml2
     ── 1. Failure: `vec_c()` throws the right error with subclassed factors (#1015)
     vec_c(a, a) not identical to subclass(factor(c("a", "a"))).
     Attributes: < Component "class": Lengths (1, 3) differ (string compare on first 1) >
     Attributes: < Component "class": 1 string mismatch >
    
     ── 2. Failure: `vec_c()` throws the right error with subclassed factors (#1015)
     `vec_c(a, b)` did not throw an error.
    
     ══ testthat results ═══════════════════════════════════════════════════════════
     [ OK: 3615 | SKIPPED: 27 | WARNINGS: 0 | FAILED: 2 ]
     1. Failure: `vec_c()` throws the right error with subclassed factors (#1015) (@test-type-factor.R#30)
     2. Failure: `vec_c()` throws the right error with subclassed factors (#1015) (@test-type-factor.R#31)
    
     Error: testthat unit tests failed
     Execution halted
Flavor: r-devel-linux-x86_64-debian-gcc

Version: 0.3.0
Check: tests
Result: ERROR
     Running ‘testthat.R’ [58s/86s]
    Running the tests in ‘tests/testthat.R’ failed.
    Complete output:
     > library(testthat)
     > library(vctrs)
     >
     > if (requireNamespace("xml2")) {
     + test_check("vctrs", reporter = MultiReporter$new(reporters = list(JunitReporter$new(file = "test-results.xml"), CheckReporter$new())))
     + } else {
     + test_check("vctrs")
     + }
     Loading required namespace: xml2
     ── 1. Failure: `vec_c()` throws the right error with subclassed factors (#1015)
     vec_c(a, a) not identical to subclass(factor(c("a", "a"))).
     Attributes: < Component "class": Lengths (1, 3) differ (string compare on first 1) >
     Attributes: < Component "class": 1 string mismatch >
    
     ── 2. Failure: `vec_c()` throws the right error with subclassed factors (#1015)
     `vec_c(a, b)` did not throw an error.
    
     ══ testthat results ═══════════════════════════════════════════════════════════
     [ OK: 3615 | SKIPPED: 27 | WARNINGS: 0 | FAILED: 2 ]
     1. Failure: `vec_c()` throws the right error with subclassed factors (#1015) (@test-type-factor.R#30)
     2. Failure: `vec_c()` throws the right error with subclassed factors (#1015) (@test-type-factor.R#31)
    
     Error: testthat unit tests failed
     Execution halted
Flavor: r-devel-linux-x86_64-fedora-clang

Version: 0.3.0
Check: tests
Result: ERROR
     Running ‘testthat.R’ [53s/62s]
    Running the tests in ‘tests/testthat.R’ failed.
    Complete output:
     > library(testthat)
     > library(vctrs)
     >
     > if (requireNamespace("xml2")) {
     + test_check("vctrs", reporter = MultiReporter$new(reporters = list(JunitReporter$new(file = "test-results.xml"), CheckReporter$new())))
     + } else {
     + test_check("vctrs")
     + }
     Loading required namespace: xml2
     ── 1. Failure: `vec_c()` throws the right error with subclassed factors (#1015)
     vec_c(a, a) not identical to subclass(factor(c("a", "a"))).
     Attributes: < Component "class": Lengths (1, 3) differ (string compare on first 1) >
     Attributes: < Component "class": 1 string mismatch >
    
     ── 2. Failure: `vec_c()` throws the right error with subclassed factors (#1015)
     `vec_c(a, b)` did not throw an error.
    
     ══ testthat results ═══════════════════════════════════════════════════════════
     [ OK: 3643 | SKIPPED: 24 | WARNINGS: 0 | FAILED: 2 ]
     1. Failure: `vec_c()` throws the right error with subclassed factors (#1015) (@test-type-factor.R#30)
     2. Failure: `vec_c()` throws the right error with subclassed factors (#1015) (@test-type-factor.R#31)
    
     Error: testthat unit tests failed
     Execution halted
Flavor: r-devel-linux-x86_64-fedora-gcc

Version: 0.3.0
Check: whether package can be installed
Result: ERROR
    Installation failed.
Flavors: r-devel-windows-ix86+x86_64, r-release-windows-ix86+x86_64