CRAN Package Check Results for Package rerddap

Last updated on 2019-07-22 06:47:47 CEST.

Flavor Version Tinstall Tcheck Ttotal Status Flags
r-devel-linux-x86_64-debian-clang 0.6.5 6.24 58.93 65.17 OK
r-devel-linux-x86_64-debian-gcc 0.6.5 5.08 46.99 52.07 OK
r-devel-linux-x86_64-fedora-clang 0.6.5 77.33 OK
r-devel-linux-x86_64-fedora-gcc 0.6.5 91.19 OK
r-devel-windows-ix86+x86_64 0.6.4 14.00 199.00 213.00 ERROR
r-patched-linux-x86_64 0.6.4 6.75 72.13 78.88 ERROR
r-patched-solaris-x86 0.6.5 108.90 OK
r-release-linux-x86_64 0.6.4 6.46 71.82 78.28 ERROR
r-release-windows-ix86+x86_64 0.6.4 13.00 165.00 178.00 ERROR
r-release-osx-x86_64 0.6.5 OK
r-oldrel-windows-ix86+x86_64 0.6.4 14.00 189.00 203.00 ERROR
r-oldrel-osx-x86_64 0.6.5 OK

Check Details

Version: 0.6.4
Check: tests
Result: ERROR
     Running 'test-all.R' [114s]
    Running the tests in 'tests/test-all.R' failed.
    Complete output:
     > library("testthat")
     > library("rerddap")
     >
     > #Sys.setenv(RERDDAP_CACHE_PATH_SUFFIX = "rerddap")
     > cache_setup(temp_dir = TRUE)
     [1] "D:\\temp\\RtmpGyMpEI/R/rerddap"
     >
     > test_check("rerddap")
     -- 1. Failure: convert_units works (@test-convert_units.R#25) -----------------
     convert_units("gggg") not equal to "gggg".
     1/1 mismatches
     x[1]: "{gggg}"
     y[1]: "gggg"
    
     == testthat results ===========================================================
     OK: 67 SKIPPED: 16 WARNINGS: 0 FAILED: 1
     1. Failure: convert_units works (@test-convert_units.R#25)
    
     Error: testthat unit tests failed
     Execution halted
Flavor: r-devel-windows-ix86+x86_64

Version: 0.6.4
Check: tests
Result: ERROR
     Running ‘test-all.R’ [28s/105s]
    Running the tests in ‘tests/test-all.R’ failed.
    Complete output:
     > library("testthat")
     > library("rerddap")
     >
     > #Sys.setenv(RERDDAP_CACHE_PATH_SUFFIX = "rerddap")
     > cache_setup(temp_dir = TRUE)
     [1] "/tmp/RtmpKVM6FX/R/rerddap"
     >
     > test_check("rerddap")
     ── 1. Failure: convert_units works (@test-convert_units.R#25) ─────────────────
     convert_units("gggg") not equal to "gggg".
     1/1 mismatches
     x[1]: "{gggg}"
     y[1]: "gggg"
    
     ══ testthat results ═══════════════════════════════════════════════════════════
     OK: 67 SKIPPED: 16 WARNINGS: 0 FAILED: 1
     1. Failure: convert_units works (@test-convert_units.R#25)
    
     Error: testthat unit tests failed
     Execution halted
Flavor: r-patched-linux-x86_64

Version: 0.6.4
Check: tests
Result: ERROR
     Running ‘test-all.R’ [28s/105s]
    Running the tests in ‘tests/test-all.R’ failed.
    Complete output:
     > library("testthat")
     > library("rerddap")
     >
     > #Sys.setenv(RERDDAP_CACHE_PATH_SUFFIX = "rerddap")
     > cache_setup(temp_dir = TRUE)
     [1] "/tmp/Rtmppd1dgB/R/rerddap"
     >
     > test_check("rerddap")
     ── 1. Failure: convert_units works (@test-convert_units.R#25) ─────────────────
     convert_units("gggg") not equal to "gggg".
     1/1 mismatches
     x[1]: "{gggg}"
     y[1]: "gggg"
    
     ══ testthat results ═══════════════════════════════════════════════════════════
     OK: 67 SKIPPED: 16 WARNINGS: 0 FAILED: 1
     1. Failure: convert_units works (@test-convert_units.R#25)
    
     Error: testthat unit tests failed
     Execution halted
Flavor: r-release-linux-x86_64

Version: 0.6.4
Check: tests
Result: ERROR
     Running 'test-all.R' [100s]
    Running the tests in 'tests/test-all.R' failed.
    Complete output:
     > library("testthat")
     > library("rerddap")
     >
     > #Sys.setenv(RERDDAP_CACHE_PATH_SUFFIX = "rerddap")
     > cache_setup(temp_dir = TRUE)
     [1] "D:\\temp\\RtmpMjaJDr/R/rerddap"
     >
     > test_check("rerddap")
     -- 1. Failure: convert_units works (@test-convert_units.R#25) -----------------
     convert_units("gggg") not equal to "gggg".
     1/1 mismatches
     x[1]: "{gggg}"
     y[1]: "gggg"
    
     == testthat results ===========================================================
     OK: 67 SKIPPED: 16 WARNINGS: 0 FAILED: 1
     1. Failure: convert_units works (@test-convert_units.R#25)
    
     Error: testthat unit tests failed
     Execution halted
Flavor: r-release-windows-ix86+x86_64

Version: 0.6.4
Check: tests
Result: ERROR
     Running 'test-all.R' [108s]
    Running the tests in 'tests/test-all.R' failed.
    Complete output:
     > library("testthat")
     > library("rerddap")
     >
     > #Sys.setenv(RERDDAP_CACHE_PATH_SUFFIX = "rerddap")
     > cache_setup(temp_dir = TRUE)
     [1] "D:\\temp\\RtmpKaLP8T/R/rerddap"
     >
     > test_check("rerddap")
     -- 1. Failure: convert_units works (@test-convert_units.R#25) -----------------
     convert_units("gggg") not equal to "gggg".
     1/1 mismatches
     x[1]: "{gggg}"
     y[1]: "gggg"
    
     == testthat results ===========================================================
     OK: 67 SKIPPED: 16 WARNINGS: 0 FAILED: 1
     1. Failure: convert_units works (@test-convert_units.R#25)
    
     Error: testthat unit tests failed
     Execution halted
Flavor: r-oldrel-windows-ix86+x86_64